Voici le bug en question :

g++ -DHAVE_CONFIG_H -I. -I. -I../../.. -I../../../inc -I../../../drv/DBC -I../../../src/DBC -I../../../drv/PCollection -I../../../src/PCollection -I../../../drv/PColStd -I../../../src/PColStd -I../../../drv/PMMgt -I../../../src/PMMgt -I../../../drv/PShort -I../../../src/PShort -I../../../drv/PStandard -I../../../src/PStandard -I../../../drv/PTColStd -I../../../src/PTColStd -I../../../drv/ObjMgt -I../../../src/ObjMgt -O2 -g -pipe -Wall -Wp,-D_FORTIFY_SOURCE=2 -fexceptions -fstack-protector --param=ssp-buffer-size=4 -m64 -mtune=generic -Wno-deprecated -D_OCC64 -ffriend-injection -fpermissive -MT DBC_VArrayNodeOfVArrayOfCharacter_0.lo -MD -MP -MF .deps/DBC_VArrayNodeOfVArrayOfCharacter_0.Tpo -c ../../../drv/DBC/DBC_VArrayNodeOfVArrayOfCharacter_0.cxx -fPIC -DPIC -o DBC_VArrayNodeOfVArrayOfCharacter_0.lo
../../../inc/DBC_BaseArray.hxx:107: error: 'DBC_DBVArray' does not name a type
../../../inc/DBC_BaseArray.hxx:108: error: expected ',' or '...' before 'p'
../../../inc/DBC_BaseArray.hxx:108: warning: ISO C++ forbids declaration of 'DBC_DBVArray' with no type
../../../inc/DBC_BaseArray.hxx:126: error: 'DBC_DBVArray' does not name a type
../../../inc/DBC_BaseArray.hxx: In member function 'void DBC_BaseArray::_CSFDB_SetDBC_BaseArraymyData(int)':
../../../inc/DBC_BaseArray.hxx:108: error: 'myData' was not declared in this scope
../../../inc/DBC_BaseArray.hxx:108: error: 'p' was not declared in this scope
make[3]: *** [DBC_VArrayNodeOfVArrayOfCharacter_0.lo] Error 1
make[3]: Leaving directory `/home/builder/rpmbuild/BUILD/OpenCASCADE6.2.0/ros/adm/make/PTKernel'
make[2]: *** [all-recursive] Error 1
make[2]: Leaving directory `/home/builder/rpmbuild/BUILD/OpenCASCADE6.2.0/ros/adm/make'
make[1]: *** [all-recursive] Error 1
make[1]: Leaving directory `/home/builder/rpmbuild/BUILD/OpenCASCADE6.2.0/ros'
make: *** [all] Error 2
erreur: Mauvais status de sortie pour /var/tmp/rpm-tmp.65422 (%build)