+ make KERNELSRC=/usr/src/kernels/2.6.22.1-27.fc7-x86_64 KERNELRELEASE=2.6.22.1-27.fc7

***** Using kernel source in /usr/src/kernels/2.6.22.1-27.fc7-x86_64 *****
make modules -C /usr/src/kernels/2.6.22.1-27.fc7-x86_64 M=/builddir/build/BUILD/wis-go7007-linux-0.9.8/_kmod_build_/kernel
make[1]: Entering directory `/usr/src/kernels/2.6.22.1-27.fc7-x86_64'
CC [M] /builddir/build/BUILD/wis-go7007-linux-0.9.8/_kmod_build_/kernel/go7007-v4l2.o
CC [M] /builddir/build/BUILD/wis-go7007-linux-0.9.8/_kmod_build_/kernel/go7007-driver.o
CC [M] /builddir/build/BUILD/wis-go7007-linux-0.9.8/_kmod_build_/kernel/go7007-i2c.o
CC [M] /builddir/build/BUILD/wis-go7007-linux-0.9.8/_kmod_build_/kernel/go7007-fw.o
LD [M] /builddir/build/BUILD/wis-go7007-linux-0.9.8/_kmod_build_/kernel/go7007.o
CC [M] /builddir/build/BUILD/wis-go7007-linux-0.9.8/_kmod_build_/kernel/go7007-usb.o
CC [M] /builddir/build/BUILD/wis-go7007-linux-0.9.8/_kmod_build_/kernel/snd-go7007.o
/builddir/build/BUILD/wis-go7007-linux-0.9.8/_kmod_build_/kernel/snd-go7007.c:61: error: expected specifier-qualifier-list before 'snd_card_t'
/builddir/build/BUILD/wis-go7007-linux-0.9.8/_kmod_build_/kernel/snd-go7007.c:71: error: expected '=', ',', ';', 'asm' or '__attribute__' before 'go7007_snd_capture_hw'
/builddir/build/BUILD/wis-go7007-linux-0.9.8/_kmod_build_/kernel/snd-go7007.c: In function 'parse_audio_stream_data':
/builddir/build/BUILD/wis-go7007-linux-0.9.8/_kmod_build_/kernel/snd-go7007.c:92: error: 'snd_pcm_runtime_t' undeclared (first use in this function)
/builddir/build/BUILD/wis-go7007-linux-0.9.8/_kmod_build_/kernel/snd-go7007.c:92: error: (Each undeclared identifier is reported only once
/builddir/build/BUILD/wis-go7007-linux-0.9.8/_kmod_build_/kernel/snd-go7007.c:92: error: for each function it appears in.)
/builddir/build/BUILD/wis-go7007-linux-0.9.8/_kmod_build_/kernel/snd-go7007.c:92: error: 'runtime' undeclared (first use in this function)
/builddir/build/BUILD/wis-go7007-linux-0.9.8/_kmod_build_/kernel/snd-go7007.c:92: error: 'struct go7007_snd' has no member named 'substream'
/builddir/build/BUILD/wis-go7007-linux-0.9.8/_kmod_build_/kernel/snd-go7007.c:93: warning: ISO C90 forbids mixed declarations and code
/builddir/build/BUILD/wis-go7007-linux-0.9.8/_kmod_build_/kernel/snd-go7007.c:95: error: 'struct go7007_snd' has no member named 'lock'
/builddir/build/BUILD/wis-go7007-linux-0.9.8/_kmod_build_/kernel/snd-go7007.c:96: error: 'struct go7007_snd' has no member named 'hw_ptr'
/builddir/build/BUILD/wis-go7007-linux-0.9.8/_kmod_build_/kernel/snd-go7007.c:97: error: 'struct go7007_snd' has no member named 'hw_ptr'
/builddir/build/BUILD/wis-go7007-linux-0.9.8/_kmod_build_/kernel/snd-go7007.c:98: error: 'struct go7007_snd' has no member named 'hw_ptr'
/builddir/build/BUILD/wis-go7007-linux-0.9.8/_kmod_build_/kernel/snd-go7007.c:99: error: 'struct go7007_snd' has no member named 'avail'
/builddir/build/BUILD/wis-go7007-linux-0.9.8/_kmod_build_/kernel/snd-go7007.c:100: error: 'struct go7007_snd' has no member named 'lock'
/builddir/build/BUILD/wis-go7007-linux-0.9.8/_kmod_build_/kernel/snd-go7007.c:101: error: 'struct go7007_snd' has no member named 'w_idx'
/builddir/build/BUILD/wis-go7007-linux-0.9.8/_kmod_build_/kernel/snd-go7007.c:102: error: 'struct go7007_snd' has no member named 'w_idx'
/builddir/build/BUILD/wis-go7007-linux-0.9.8/_kmod_build_/kernel/snd-go7007.c:104: error: 'struct go7007_snd' has no member named 'w_idx'
/builddir/build/BUILD/wis-go7007-linux-0.9.8/_kmod_build_/kernel/snd-go7007.c:104: error: 'struct go7007_snd' has no member named 'w_idx'
/builddir/build/BUILD/wis-go7007-linux-0.9.8/_kmod_build_/kernel/snd-go7007.c:107: error: 'struct go7007_snd' has no member named 'w_idx'
/builddir/build/BUILD/wis-go7007-linux-0.9.8/_kmod_build_/kernel/snd-go7007.c:109: error: 'struct go7007_snd' has no member named 'w_idx'
/builddir/build/BUILD/wis-go7007-linux-0.9.8/_kmod_build_/kernel/snd-go7007.c:109: error: 'struct go7007_snd' has no member named 'w_idx'
/builddir/build/BUILD/wis-go7007-linux-0.9.8/_kmod_build_/kernel/snd-go7007.c:110: error: 'struct go7007_snd' has no member named 'w_idx'
/builddir/build/BUILD/wis-go7007-linux-0.9.8/_kmod_build_/kernel/snd-go7007.c:111: error: 'struct go7007_snd' has no member named 'lock'
/builddir/build/BUILD/wis-go7007-linux-0.9.8/_kmod_build_/kernel/snd-go7007.c:112: error: 'struct go7007_snd' has no member named 'avail'
/builddir/build/BUILD/wis-go7007-linux-0.9.8/_kmod_build_/kernel/snd-go7007.c:113: error: 'struct go7007_snd' has no member named 'lock'
/builddir/build/BUILD/wis-go7007-linux-0.9.8/_kmod_build_/kernel/snd-go7007.c:116: error: 'struct go7007_snd' has no member named 'avail'
/builddir/build/BUILD/wis-go7007-linux-0.9.8/_kmod_build_/kernel/snd-go7007.c:117: error: 'struct go7007_snd' has no member named 'lock'
/builddir/build/BUILD/wis-go7007-linux-0.9.8/_kmod_build_/kernel/snd-go7007.c:118: error: 'struct go7007_snd' has no member named 'capturing'
/builddir/build/BUILD/wis-go7007-linux-0.9.8/_kmod_build_/kernel/snd-go7007.c:119: error: 'struct go7007_snd' has no member named 'substream'
/builddir/build/BUILD/wis-go7007-linux-0.9.8/_kmod_build_/kernel/snd-go7007.c: At top level:
/builddir/build/BUILD/wis-go7007-linux-0.9.8/_kmod_build_/kernel/snd-go7007.c:122: error: expected ')' before '*' token
/builddir/build/BUILD/wis-go7007-linux-0.9.8/_kmod_build_/kernel/snd-go7007.c:140: error: expected ')' before '*' token
/builddir/build/BUILD/wis-go7007-linux-0.9.8/_kmod_build_/kernel/snd-go7007.c:151: error: expected ')' before '*' token
/builddir/build/BUILD/wis-go7007-linux-0.9.8/_kmod_build_/kernel/snd-go7007.c:169: error: expected ')' before '*' token
/builddir/build/BUILD/wis-go7007-linux-0.9.8/_kmod_build_/kernel/snd-go7007.c:178: error: expected ')' before '*' token
/builddir/build/BUILD/wis-go7007-linux-0.9.8/_kmod_build_/kernel/snd-go7007.c:183: error: expected ')' before '*' token
/builddir/build/BUILD/wis-go7007-linux-0.9.8/_kmod_build_/kernel/snd-go7007.c:203: error: expected ')' before '*' token
/builddir/build/BUILD/wis-go7007-linux-0.9.8/_kmod_build_/kernel/snd-go7007.c:211: error: expected ')' before '*' token
/builddir/build/BUILD/wis-go7007-linux-0.9.8/_kmod_build_/kernel/snd-go7007.c:217: error: expected '=', ',', ';', 'asm' or '__attribute__' before 'go7007_snd_capture_ops'
/builddir/build/BUILD/wis-go7007-linux-0.9.8/_kmod_build_/kernel/snd-go7007.c:229: error: expected ')' before '*' token
/builddir/build/BUILD/wis-go7007-linux-0.9.8/_kmod_build_/kernel/snd-go7007.c:240: error: expected '=', ',', ';', 'asm' or
'__attribute__' before 'go7007_snd_device_ops'
/builddir/build/BUILD/wis-go7007-linux-0.9.8/_kmod_build_/kernel/snd-go7007.c: In function 'go7007_snd_init':
/builddir/build/BUILD/wis-go7007-linux-0.9.8/_kmod_build_/kernel/snd-go7007.c:259: error: 'struct go7007_snd' has no member named 'lock'
/builddir/build/BUILD/wis-go7007-linux-0.9.8/_kmod_build_/kernel/snd-go7007.c:260: error: 'struct go7007_snd' has no member named 'hw_ptr'
/builddir/build/BUILD/wis-go7007-linux-0.9.8/_kmod_build_/kernel/snd-go7007.c:260: error: 'struct go7007_snd' has no member named 'w_idx'
/builddir/build/BUILD/wis-go7007-linux-0.9.8/_kmod_build_/kernel/snd-go7007.c:260: error: 'struct go7007_snd' has no member named 'avail'
/builddir/build/BUILD/wis-go7007-linux-0.9.8/_kmod_build_/kernel/snd-go7007.c:261: error: 'struct go7007_snd' has no member named 'capturing'
/builddir/build/BUILD/wis-go7007-linux-0.9.8/_kmod_build_/kernel/snd-go7007.c:262: error: 'struct go7007_snd' has no member named 'card'
/builddir/build/BUILD/wis-go7007-linux-0.9.8/_kmod_build_/kernel/snd-go7007.c:263: error: 'struct go7007_snd' has no member named 'card'
/builddir/build/BUILD/wis-go7007-linux-0.9.8/_kmod_build_/kernel/snd-go7007.c:267: error: 'struct go7007_snd' has no member named 'card'
/builddir/build/BUILD/wis-go7007-linux-0.9.8/_kmod_build_/kernel/snd-go7007.c:268: error: 'go7007_snd_device_ops' undeclared (first use in this function)
/builddir/build/BUILD/wis-go7007-linux-0.9.8/_kmod_build_/kernel/snd-go7007.c:273: error: 'struct go7007_snd' has no member named 'card'
/builddir/build/BUILD/wis-go7007-linux-0.9.8/_kmod_build_/kernel/snd-go7007.c:274: error: 'struct go7007_snd' has no member named 'card'
/builddir/build/BUILD/wis-go7007-linux-0.9.8/_kmod_build_/kernel/snd-go7007.c:274: error: 'struct go7007_snd' has no member named 'pcm'
/builddir/build/BUILD/wis-go7007-linux-0.9.8/_kmod_build_/kernel/snd-go7007.c:276: error: 'struct go7007_snd' has no member named 'card'
/builddir/build/BUILD/wis-go7007-linux-0.9.8/_kmod_build_/kernel/snd-go7007.c:280: error: 'struct go7007_snd' has no member named 'card'
/builddir/build/BUILD/wis-go7007-linux-0.9.8/_kmod_build_/kernel/snd-go7007.c:280: error: 'struct go7007_snd' has no member named 'card'
/builddir/build/BUILD/wis-go7007-linux-0.9.8/_kmod_build_/kernel/snd-go7007.c:281: error: 'struct go7007_snd' has no member named 'card'
/builddir/build/BUILD/wis-go7007-linux-0.9.8/_kmod_build_/kernel/snd-go7007.c:281: error: 'struct go7007_snd' has no member named 'card'
/builddir/build/BUILD/wis-go7007-linux-0.9.8/_kmod_build_/kernel/snd-go7007.c:282: error: 'struct go7007_snd' has no member named 'card'
/builddir/build/BUILD/wis-go7007-linux-0.9.8/_kmod_build_/kernel/snd-go7007.c:282: error: 'struct go7007_snd' has no member named 'card'
/builddir/build/BUILD/wis-go7007-linux-0.9.8/_kmod_build_/kernel/snd-go7007.c:283: error: 'struct go7007_snd' has no member named 'card'
/builddir/build/BUILD/wis-go7007-linux-0.9.8/_kmod_build_/kernel/snd-go7007.c:285: error: 'struct go7007_snd' has no member named 'pcm'
/builddir/build/BUILD/wis-go7007-linux-0.9.8/_kmod_build_/kernel/snd-go7007.c:286: error: 'struct go7007_snd' has no member named 'pcm'
/builddir/build/BUILD/wis-go7007-linux-0.9.8/_kmod_build_/kernel/snd-go7007.c:287: error: 'go7007_snd_capture_ops' undeclared (first use in this function)
/builddir/build/BUILD/wis-go7007-linux-0.9.8/_kmod_build_/kernel/snd-go7007.c:289: error: 'struct go7007_snd' has no member named 'card'
/builddir/build/BUILD/wis-go7007-linux-0.9.8/_kmod_build_/kernel/snd-go7007.c:291: error: 'struct go7007_snd' has no member named 'card'
/builddir/build/BUILD/wis-go7007-linux-0.9.8/_kmod_build_/kernel/snd-go7007.c:296: error: 'struct go7007_snd' has no member named 'substream'
/builddir/build/BUILD/wis-go7007-linux-0.9.8/_kmod_build_/kernel/snd-go7007.c: In function 'go7007_snd_remove':
/builddir/build/BUILD/wis-go7007-linux-0.9.8/_kmod_build_/kernel/snd-go7007.c:309: error: 'struct go7007_snd' has no member named 'card'
/builddir/build/BUILD/wis-go7007-linux-0.9.8/_kmod_build_/kernel/snd-go7007.c:313: error: 'struct go7007_snd' has no member named 'card'
make[2]: *** [/builddir/build/BUILD/wis-go7007-linux-0.9.8/_kmod_build_/kernel/snd-go7007.o] Error 1
make[1]: *** [_module_/builddir/build/BUILD/wis-go7007-linux-0.9.8/_kmod_build_/kernel] Error 2
make[1]: Leaving directory `/usr/src/kernels/2.6.22.1-27.fc7-x86_64'
make: *** [all] Error 2
error: Bad exit status from /var/tmp/rpm-tmp.17436 (%build)